Reaction Details
TargetAlpha-1A adrenergic receptor
LigandBDBM50081822
Substrate/Competitorn/a
Meas. Tech.ChEBML_33606
Ki 6.3±n/a nM
Citation Marzabadi, MRHong, XNagarathnam, DMiao, SWChiu, GWong, WCWetzel, JMFang, JForray, CChen, TBO'Malley, SSChang, RSGluchowski, C Design and synthesis of novel dihydropyridine alpha-1a antagonists. Bioorg Med Chem Lett9:2843-8 (1999) Alpha-1A adrenergic receptor
Name:Alpha-1A adrenergic receptor
Type:Cell-surface receptors
Mol. Mass.:51511.67
Organism:Homo sapiens (Human)
Description:P35348
Residue:466
BDBM50081822
NameBDBM50081822
Synonyms:2-(2-Amino-ethoxymethyl)-6-methyl-4-(4-nitro-phenyl)-1,4-dihydro-pyridine-3,5-dicarboxylic acid 5-amide 3-({3-[4-(4-methoxy-phenyl)-4-phenyl-piperidin-1-yl]-propyl}-amide) | CHEMBL330401
TypeSmall organic molecule
Emp. Form.C38H46N6O6
Mol. Mass.682.8084
SMILESCOc1ccc(cc1)C1(CCN(CCCNC(=O)C2=C(COCCN)N=C(C)C(C2c2ccc(cc2)[N+]([O-])=O)C(N)=O)CC1)c1ccccc1