Reaction Details
TargetTransient receptor potential cation channel subfamily V member 1
LigandBDBM50082238
Substrate/Competitorn/a
Meas. Tech.ChEBML_215486
Ki 19300±n/a nM
Citation Lee, JPark, SUKim, JYKim, JKLee, JOh, UMarquez, VEBeheshti, MWang, QJModarres, SBlumberg, PM 3-Acyloxy-2-phenalkylpropyl amides and esters of homovanillic acid as novel vanilloid receptor agonists. Bioorg Med Chem Lett9:2909-14 (1999) Transient receptor potential cation channel subfamily V member 1
Name:Transient receptor potential cation channel subfamily V member 1
Type:Transient Receptor
Mol. Mass.:94956.12
Organism:Rattus norvegicus (rat)
Description:O35433
Residue:838
BDBM50082238
NameBDBM50082238
Synonyms:Acetic acid 2-benzyl-3-[2-(4-hydroxy-3-methoxy-phenyl)-acetylamino]-propyl ester | CHEMBL100887
TypeSmall organic molecule
Emp. Form.C21H25NO5
Mol. Mass.371.4269
SMILESCOc1cc(CC(=O)NCC(COC(C)=O)Cc2ccccc2)ccc1O