Reaction Details
TargetTransient receptor potential cation channel subfamily V member 1
LigandBDBM50082240
Substrate/Competitorn/a
Meas. Tech.ChEBML_215486
Ki 12900±n/a nM
Citation Lee, JPark, SUKim, JYKim, JKLee, JOh, UMarquez, VEBeheshti, MWang, QJModarres, SBlumberg, PM 3-Acyloxy-2-phenalkylpropyl amides and esters of homovanillic acid as novel vanilloid receptor agonists. Bioorg Med Chem Lett9:2909-14 (1999) Transient receptor potential cation channel subfamily V member 1
Name:Transient receptor potential cation channel subfamily V member 1
Type:Transient Receptor
Mol. Mass.:94956.12
Organism:Rattus norvegicus (rat)
Description:O35433
Residue:838
BDBM50082240
NameBDBM50082240
Synonyms:Acetic acid (E)-2-{[2-(4-hydroxy-3-methoxy-phenyl)-acetylamino]-methyl}-4-phenyl-but-2-enyl ester | CHEMBL318503
TypeSmall organic molecule
Emp. Form.C22H25NO5
Mol. Mass.383.4376
SMILESCOc1cc(CC(=O)NC\C(COC(C)=O)=C/Cc2ccccc2)ccc1O