Reaction Details
Target5-hydroxytryptamine receptor 1A
LigandBDBM50082413
Substrate/Competitorn/a
Meas. Tech.ChEMBL_941 (CHEMBL616120)
Ki 1.7±n/a nM
Citation van Niel, MBBeer, MSCastro, JLCheng, SKEvans, DCHeald, AHitzel, LHunt, PMortishire-Smith, RO'Connor, DWatt, APMacLeod, AM Parallel synthesis of 3-aryloxy-2-propanolamines and evaluation as dual affinity 5-HT(1A) and 5-HT re-uptake ligands. Bioorg Med Chem Lett9:3243-8 (1999) 5-hydroxytryptamine receptor 1A
Name:5-hydroxytryptamine receptor 1A
Type:n/a
Mol. Mass.:46122.49
Organism:Homo sapiens (Human)
Description:n/a
Residue:422
BDBM50082413
NameBDBM50082413
Synonyms:1-(3-ethylphenoxy)-3-spiro[1,3-dihydrobenzo[e]isobenzofuran-3,4'-(hexahydropyridine)]-1-yl-(2S)-propan-2-ol | CHEMBL111065
TypeSmall organic molecule
Emp. Form.C27H31NO3
Mol. Mass.417.5399
SMILESCCc1cccc(OC[C@@H](O)CN2CCC3(CC2)OCc2c3ccc3ccccc23)c1