Reaction Details
TargetPlasminogen
LigandBDBM50074921
Substrate/Competitorn/a
Meas. Tech.ChEBML_155604
Ki 60±n/a nM
Citation Garrett, GSMcPhail, SJTornheim, KCorrea, PEMcIver, JM Synthesis of potent and selective inhibitors of human plasma kallikrein. Bioorg Med Chem Lett9:301-6 (1999) Plasminogen
Name:Plasminogen
Type:Protein
Mol. Mass.:90541.87
Organism:Rattus norvegicus
Description:Q01177
Residue:812
BDBM50074921
NameBDBM50074921
Synonyms:[(R)-1-({(S)-Naphthalen-2-yl-[3,3,3-trifluoro-1-(4-guanidino-benzyl)-2-oxo-propylcarbamoyl]-methyl}-carbamoyl)-2-phenyl-ethyl]-carbamic acid tert-butyl ester
TypeSmall organic molecule
Emp. Form.C37H40F3N6O5
Mol. Mass.705.7454
SMILESCC(C)(C)OC(=O)N[C@H](Cc1ccccc1)C(=O)N[C@H](C(=O)NC(Cc1ccc(NC(N)=[NH2+])cc1)C(=O)C(F)(F)F)c1ccc2ccccc2c1