Reaction Details
TargetDelta-type opioid receptor
LigandBDBM50451002
Substrate/Competitorn/a
Meas. Tech.ChEBML_217729
Ki 4.4±n/a nM
Citation Husbands, SMBreeden, SWGrivas, KLewis, JW Ring constrained analogues of the orvinols: the furanomorphides. Bioorg Med Chem Lett9:831-4 (1999) Delta-type opioid receptor
Name:Delta-type opioid receptor
Type:G Protein-Coupled Receptor (GPCR)
Mol. Mass.:40382.98
Organism:Homo sapiens (Human)
Description:Competition binding assays were carried out using membrane preparations from transfected HN9.10 cells that constitutively expressed the delta opioid receptor.
Residue:372
BDBM50451002
NameBDBM50451002
Synonyms:CHEMBL2110199
TypeSmall organic molecule
Emp. Form.C25H33NO3
Mol. Mass.395.5344
SMILES[H][C@]12C[C@]34CC[C@]1(OC(C)(C)C2(C)C)[C@]1([H])Oc2c5c(CC3N(C)CC[C@@]415)ccc2O