Reaction Details
TargetMu-type opioid receptor
LigandBDBM50076005
Substrate/Competitorn/a
Meas. Tech.ChEBML_221911
Ki 0.100000±n/a nM
Citation Husbands, SMBreeden, SWGrivas, KLewis, JW Ring constrained analogues of the orvinols: the furanomorphides. Bioorg Med Chem Lett9:831-4 (1999) Mu-type opioid receptor
Name:Mu-type opioid receptor
Type:Enzyme Catalytic Domain
Mol. Mass.:11165.58
Organism:GUINEA PIG
Description:P97266
Residue:98
BDBM50076005
NameBDBM50076005
Synonyms:2-[11,15-dimethoxy-3-methyl-(14R,15S)-13-oxa-3-azahexacyclo[13.2.2.12,8.01,6.06,14.07,12]icosa-7,9,11-trien-16-yl]-3,3-dimethyl-2-butanol | CHEMBL349841
TypeSmall organic molecule
Emp. Form.C25H35NO4
Mol. Mass.413.5497
SMILESCO[C@@]12CCC3(C[C@@H]1[C@](C)(O)C(C)C)[C@H]1Cc4ccc(O)c5O[C@@H]2C3(CCN1C)c45