Reaction Details
TargetKappa-type opioid receptor
LigandBDBM50354578
Substrate/Competitorn/a
Meas. Tech.ChEBML_220922
Ki 1.5±n/a nM
Citation Husbands, SMBreeden, SWGrivas, KLewis, JW Ring constrained analogues of the orvinols: the furanomorphides. Bioorg Med Chem Lett9:831-4 (1999) Kappa-type opioid receptor
Name:Kappa-type opioid receptor
Type:G Protein-Coupled Receptor (GPCR)
Mol. Mass.:42744.99
Organism:Cavia porcellus (domestic guinea pig)
Description:P41144
Residue:380
BDBM50354578
NameBDBM50354578
Synonyms:BUPRENORPHINE US11534436, Compound buprenorphine | US9315514, Buprenorphine
TypeSmall organic molecule
Emp. Form.C29H41NO4
Mol. Mass.467.6401
SMILESCO[C@@]12CC[C@@]3(C[C@@H]1[C@](C)(O)C(C)(C)C)[C@H]1Cc4ccc(O)c5O[C@@H]2[C@]3(CCN1CC1CC1)c45