Reaction Details
TargetKappa-type opioid receptor
LigandBDBM50076002
Substrate/Competitorn/a
Meas. Tech.ChEBML_220922
Ki 0.400000±n/a nM
Citation Husbands, SMBreeden, SWGrivas, KLewis, JW Ring constrained analogues of the orvinols: the furanomorphides. Bioorg Med Chem Lett9:831-4 (1999) Kappa-type opioid receptor
Name:Kappa-type opioid receptor
Type:G Protein-Coupled Receptor (GPCR)
Mol. Mass.:42744.99
Organism:Cavia porcellus (domestic guinea pig)
Description:P41144
Residue:380
BDBM50076002
NameBDBM50076002
Synonyms:2-(3-cyclopropylmethyl-11-hydroxy-15-methoxy-13-oxa-3-azahexacyclo[13.2.2.12,8.01,6.06,14.07,12]icosa-7,9,11-trien-16-yl)-2-propanol Diprenorphine
TypeSmall organic molecule
Emp. Form.C26H35NO4
Mol. Mass.425.5604
SMILESCOC12CCC3(CC1C(C)(C)O)C1Cc4ccc(O)c5OC2C3(CCN1CC1CC1)c45