Reaction Details
TargetInterstitial collagenase
LigandBDBM50076989
Substrate/Competitorn/a
Meas. Tech.ChEMBL_101758 (CHEMBL709114)
Ki<1±n/a nM
Citation Cherney, RJWang, LMeyer, DTXue, CBArner, ECCopeland, RACovington, MBHardman, KDWasserman, ZRJaffee, BDDecicco, CP Macrocyclic hydroxamate inhibitors of matrix metalloproteinases and TNF-alpha production. Bioorg Med Chem Lett9:1279-84 (1999) Interstitial collagenase
Name:Interstitial collagenase
Type:Enzyme
Mol. Mass.:54010.26
Organism:Homo sapiens (Human)
Description: P03956
Residue:469
BDBM50076989
NameBDBM50076989
Synonyms:(2S,11S,12R)-12-Isobutyl-7-(1-methyl-1H-imidazole-4-sulfonyl)-13-oxo-1,7diaza-cyclotridecane-2,11-dicarboxylic acid 11-hydroxyamide 2-methylamide | CHEMBL283427
TypeSmall organic molecule
Emp. Form.C22H38N6O6S
Mol. Mass.514.639
SMILESCNC(=O)[C@@H]1CCCCN(CCC[C@@H]([C@@H](CC(C)C)C(=O)N1)C(=O)NO)S(=O)(=O)c1cn(C)cn1