Reaction Details
TargetMatrix metalloproteinase-9
LigandBDBM50076992
Substrate/Competitorn/a
Meas. Tech.ChEBML_102117
Ki 1.6±n/a nM
Citation Cherney, RJWang, LMeyer, DTXue, CBArner, ECCopeland, RACovington, MBHardman, KDWasserman, ZRJaffee, BDDecicco, CP Macrocyclic hydroxamate inhibitors of matrix metalloproteinases and TNF-alpha production. Bioorg Med Chem Lett9:1279-84 (1999) Matrix metalloproteinase-9
Name:Matrix metalloproteinase-9
Type:Enzyme
Mol. Mass.:78452.28
Organism:Homo sapiens (Human)
Description:P14780
Residue:707
BDBM50076992
NameBDBM50076992
Synonyms:(2S,11S,12R)-7-(4-Amino-benzenesulfonyl)-12-isobutyl-13-oxo-1,7diaza-cyclotridecane-2,11-dicarboxylic acid 11-hydroxyamide 2-methylamide | CHEMBL24347
TypeSmall organic molecule
Emp. Form.C24H39N5O6S
Mol. Mass.525.661
SMILESCNC(=O)[C@@H]1CCCCN(CCC[C@@H]([C@@H](CC(C)C)C(=O)N1)C(=O)NO)S(=O)(=O)c1ccc(N)cc1