Reaction Details
TargetInterstitial collagenase
LigandBDBM50076994
Substrate/Competitorn/a
Meas. Tech.ChEBML_101758
Ki 2.3±n/a nM
Citation Cherney, RJWang, LMeyer, DTXue, CBArner, ECCopeland, RACovington, MBHardman, KDWasserman, ZRJaffee, BDDecicco, CP Macrocyclic hydroxamate inhibitors of matrix metalloproteinases and TNF-alpha production. Bioorg Med Chem Lett9:1279-84 (1999) Interstitial collagenase
Name:Interstitial collagenase
Type:Enzyme
Mol. Mass.:54010.26
Organism:Homo sapiens (Human)
Description: P03956
Residue:469
BDBM50076994
NameBDBM50076994
Synonyms:(2S,11S,12R)-12-Isobutyl-13-oxo-7-(2,4,6-trimethyl-benzenesulfonyl)-1,7diaza-cyclotridecane-2,11-dicarboxylic acid 11-hydroxyamide 2-methylamide | CHEMBL277658
TypeSmall organic molecule
Emp. Form.C27H44N4O6S
Mol. Mass.552.726
SMILESCNC(=O)[C@@H]1CCCCN(CCC[C@@H]([C@@H](CC(C)C)C(=O)N1)C(=O)NO)S(=O)(=O)c1c(C)cc(C)cc1C