Reaction Details
TargetMatrix metalloproteinase-9
LigandBDBM50076993
Substrate/Competitorn/a
Meas. Tech.ChEBML_102117
Ki 13±n/a nM
Citation Cherney, RJWang, LMeyer, DTXue, CBArner, ECCopeland, RACovington, MBHardman, KDWasserman, ZRJaffee, BDDecicco, CP Macrocyclic hydroxamate inhibitors of matrix metalloproteinases and TNF-alpha production. Bioorg Med Chem Lett9:1279-84 (1999) Matrix metalloproteinase-9
Name:Matrix metalloproteinase-9
Type:Enzyme
Mol. Mass.:78452.28
Organism:Homo sapiens (Human)
Description:P14780
Residue:707
BDBM50076993
NameBDBM50076993
Synonyms:(2S,11S,12R)-12-Isobutyl-13-oxo-1,7diaza-cyclotridecane-2,11-dicarboxylic acid 11-hydroxyamide 2-methylamide; hydrochloride CHEMBL88220
TypeSmall organic molecule
Emp. Form.C18H34N4O4
Mol. Mass.370.487
SMILESCNC(=O)[C@@H]1CCCCNCCC[C@@H]([C@@H](CC(C)C)C(=O)N1)C(=O)NO