Reaction Details
Target5-hydroxytryptamine receptor 2C
LigandBDBM82247
Substrate/Competitorn/a
Meas. Tech.ChEBML_2831
Ki 13±n/a nM
Citation Tamagnan, GBaldwin, RMKula, NSBaldessarini, RJInnis, RB Cyclopentadienyltricarbonylrheniumbenzazepines: synthesis and binding affinity. Bioorg Med Chem Lett10:1113-5 (2000) 5-hydroxytryptamine receptor 2C
Name:5-hydroxytryptamine receptor 2C
Type:Enzyme
Mol. Mass.:51935.10
Organism:Rattus norvegicus (Rat)
Description:P08909
Residue:460
BDBM82247
NameBDBM82247
Synonyms:8-Chloro-3-methyl-5-phenyl-2,3,4,5-tetrahydro-1H-benzo[d]azepin-7-ol(SCH 23390) CHEMBL2158641 SCH 23388 SCH 23390 (R-enantiomer) | SCH 23390,R(+)
TypeSmall organic molecule
Emp. Form.C17H18ClNO
Mol. Mass.287.784
SMILESCN1CCc2cc(Cl)c(O)cc2[C@H](C1)c1ccccc1