Reaction Details
TargetCarbonic anhydrase 2
LigandBDBM50079043
Substrate/Competitorn/a
Meas. Tech.ChEBML_45239
Ki 28±n/a nM
Citation Scozzafava, ASupuran, CT Carbonic anhydrase inhibitors: synthesis of N-morpholylthiocarbonylsulfenylamino aromatic/heterocyclic sulfonamides and their interaction with isozymes I, II and IV. Bioorg Med Chem Lett10:1117-20 (2000) Carbonic anhydrase 2
Name:Carbonic anhydrase 2
Type:Enzyme
Mol. Mass.:29250.71
Organism:Homo sapiens (Human)
Description:P00918
Residue:260
BDBM50079043
NameBDBM50079043
Synonyms:4-Amino-5,6-dichloro-benzene-1,3-disulfonic acid diamide BDBM50222601 | CHEMBL269628
TypeSmall organic molecule
Emp. Form.C6H7Cl2N3O4S2
Mol. Mass.320.173
SMILESNc1c(Cl)c(Cl)c(cc1S(N)(=O)=O)S(N)(=O)=O