Reaction Details
TargetCarbonic anhydrase 4
LigandBDBM50088778
Substrate/Competitorn/a
Meas. Tech.ChEBML_45432
Ki 1.3±n/a nM
Citation Scozzafava, ASupuran, CT Carbonic anhydrase inhibitors: synthesis of N-morpholylthiocarbonylsulfenylamino aromatic/heterocyclic sulfonamides and their interaction with isozymes I, II and IV. Bioorg Med Chem Lett10:1117-20 (2000) Carbonic anhydrase 4
Name:Carbonic anhydrase 4
Type:Enzyme
Mol. Mass.:35152.74
Organism:Bos taurus (bovine)
Description:Bovine isozyme, isolated from lung microsomes
Residue:312
BDBM50088778
NameBDBM50088778
Synonyms:CHEMBL275565 | N,N-dialkylthio-carbonylsulfenylamino derivative
TypeSmall organic molecule
Emp. Form.C14H18N6O5S5
Mol. Mass.510.655
SMILESCn1nc(s\c1=N\S(=O)(=O)c1ccc(NSC(=S)N2CCOCC2)cc1)S(N)(=O)=O