Reaction Details
TargetCarbonic anhydrase 2
LigandBDBM50088771
Substrate/Competitorn/a
Meas. Tech.ChEBML_45239
Ki 2±n/a nM
Citation Scozzafava, ASupuran, CT Carbonic anhydrase inhibitors: synthesis of N-morpholylthiocarbonylsulfenylamino aromatic/heterocyclic sulfonamides and their interaction with isozymes I, II and IV. Bioorg Med Chem Lett10:1117-20 (2000) Carbonic anhydrase 2
Name:Carbonic anhydrase 2
Type:Enzyme
Mol. Mass.:29250.71
Organism:Homo sapiens (Human)
Description:P00918
Residue:260
BDBM50088771
NameBDBM50088771
Synonyms:CHEMBL13802 | N,N-dialkylthio-carbonylsulfenylamino derivative
TypeSmall organic molecule
Emp. Form.C10H16N6O4S4
Mol. Mass.412.532
SMILESNS(=O)(=O)c1nnc(NC(=O)CCNSC(=S)N2CCOCC2)s1