Reaction Details
TargetCarbonic anhydrase 2
LigandBDBM50088772
Substrate/Competitorn/a
Meas. Tech.ChEBML_45239
Ki 7±n/a nM
Citation Scozzafava, ASupuran, CT Carbonic anhydrase inhibitors: synthesis of N-morpholylthiocarbonylsulfenylamino aromatic/heterocyclic sulfonamides and their interaction with isozymes I, II and IV. Bioorg Med Chem Lett10:1117-20 (2000) Carbonic anhydrase 2
Name:Carbonic anhydrase 2
Type:Enzyme
Mol. Mass.:29250.71
Organism:Homo sapiens (Human)
Description:P00918
Residue:260
BDBM50088772
NameBDBM50088772
Synonyms:CHEMBL13555 | N,N-dialkylthio-carbonylsulfenylamino derivative
TypeSmall organic molecule
Emp. Form.C17H20N4O5S4
Mol. Mass.488.624
SMILESNS(=O)(=O)c1cccc(NS(=O)(=O)c2ccc(NSC(=S)N3CCOCC3)cc2)c1