Reaction Details
TargetCarbonic anhydrase 1
LigandBDBM50088772
Substrate/Competitorn/a
Meas. Tech.ChEBML_44856
Ki 31±n/a nM
Citation Scozzafava, ASupuran, CT Carbonic anhydrase inhibitors: synthesis of N-morpholylthiocarbonylsulfenylamino aromatic/heterocyclic sulfonamides and their interaction with isozymes I, II and IV. Bioorg Med Chem Lett10:1117-20 (2000) Carbonic anhydrase 1
Name:Carbonic anhydrase 1
Type:Enzyme
Mol. Mass.:28873.37
Organism:Homo sapiens (Human)
Description:P00915
Residue:261
BDBM50088772
NameBDBM50088772
Synonyms:CHEMBL13555 | N,N-dialkylthio-carbonylsulfenylamino derivative
TypeSmall organic molecule
Emp. Form.C17H20N4O5S4
Mol. Mass.488.624
SMILESNS(=O)(=O)c1cccc(NS(=O)(=O)c2ccc(NSC(=S)N3CCOCC3)cc2)c1