Reaction Details
TargetCarbonic anhydrase 4
LigandBDBM50088758
Substrate/Competitorn/a
Meas. Tech.ChEBML_45432
Ki 41±n/a nM
Citation Scozzafava, ASupuran, CT Carbonic anhydrase inhibitors: synthesis of N-morpholylthiocarbonylsulfenylamino aromatic/heterocyclic sulfonamides and their interaction with isozymes I, II and IV. Bioorg Med Chem Lett10:1117-20 (2000) Carbonic anhydrase 4
Name:Carbonic anhydrase 4
Type:Enzyme
Mol. Mass.:35152.74
Organism:Bos taurus (bovine)
Description:Bovine isozyme, isolated from lung microsomes
Residue:312
BDBM50088758
NameBDBM50088758
Synonyms:CHEMBL266387 | N,N-dialkylthio-carbonylsulfenylamino derivative
TypeSmall organic molecule
Emp. Form.C11H17N3O2S3
Mol. Mass.319.467
SMILESCCN(C)C(=S)SNCc1ccc(cc1)S(N)(=O)=O