Reaction Details
TargetCarbonic anhydrase 4
LigandBDBM50088779
Substrate/Competitorn/a
Meas. Tech.ChEBML_45432
Ki 22±n/a nM
Citation Scozzafava, ASupuran, CT Carbonic anhydrase inhibitors: synthesis of N-morpholylthiocarbonylsulfenylamino aromatic/heterocyclic sulfonamides and their interaction with isozymes I, II and IV. Bioorg Med Chem Lett10:1117-20 (2000) Carbonic anhydrase 4
Name:Carbonic anhydrase 4
Type:Enzyme
Mol. Mass.:35152.74
Organism:Bos taurus (bovine)
Description:Bovine isozyme, isolated from lung microsomes
Residue:312
BDBM50088779
NameBDBM50088779
Synonyms:CHEMBL418163 | N,N-dialkylthio-carbonylsulfenylamino derivative
TypeSmall organic molecule
Emp. Form.C15H23N3O5S5
Mol. Mass.485.685
SMILESCCN(SC(=S)N1CCOCC1)C1CC(C)S(=O)(=O)c2sc(cc12)S(N)(=O)=O