Reaction Details
TargetCarbonic anhydrase 2
LigandBDBM50088770
Substrate/Competitorn/a
Meas. Tech.ChEBML_45239
Ki 6±n/a nM
Citation Scozzafava, ASupuran, CT Carbonic anhydrase inhibitors: synthesis of N-morpholylthiocarbonylsulfenylamino aromatic/heterocyclic sulfonamides and their interaction with isozymes I, II and IV. Bioorg Med Chem Lett10:1117-20 (2000) Carbonic anhydrase 2
Name:Carbonic anhydrase 2
Type:Enzyme
Mol. Mass.:29250.71
Organism:Homo sapiens (Human)
Description:P00918
Residue:260
BDBM50088770
NameBDBM50088770
Synonyms:CHEMBL276869 | N,N-dialkylthio-carbonylsulfenylamino derivative
TypeSmall organic molecule
Emp. Form.C8H13N5O3S4
Mol. Mass.355.481
SMILESCn1nc(s\c1=N\SC(=S)N1CCOCC1)S(N)(=O)=O