Reaction Details
TargetCarbonic anhydrase 2
LigandBDBM50079068
Substrate/Competitorn/a
Meas. Tech.ChEBML_45239
Ki 3±n/a nM
Citation Scozzafava, ASupuran, CT Carbonic anhydrase inhibitors: synthesis of N-morpholylthiocarbonylsulfenylamino aromatic/heterocyclic sulfonamides and their interaction with isozymes I, II and IV. Bioorg Med Chem Lett10:1117-20 (2000) Carbonic anhydrase 2
Name:Carbonic anhydrase 2
Type:Enzyme
Mol. Mass.:29250.71
Organism:Homo sapiens (Human)
Description:P00918
Residue:260
BDBM50079068
NameBDBM50079068
Synonyms:3-amino-N-(5-sulfamoyl-[1,3,4]thiadiazol-2-yl)-propionamide | CHEMBL13646
TypeSmall organic molecule
Emp. Form.C5H9N5O3S2
Mol. Mass.251.287
SMILESNCCC(=O)Nc1nnc(s1)S(N)(=O)=O