Reaction Details
TargetGlutamate receptor ionotropic, kainate 1
LigandBDBM17657
Substrate/Competitorn/a
Meas. Tech.ChEMBL_71990 (CHEMBL683542)
EC50 75000±n/a nM
Citation Baker, SRBleakman, DEzquerra, JBallyk, BADeverill, MHo, KKamboj, RKCollado, IDomínguez, CEscribano, AMateo, AIPedregal, CRubio, A 4-Alkylidenyl glutamic acids, potent and selective GluR5 agonists. Bioorg Med Chem Lett10:1807-10 (2000) Glutamate receptor ionotropic, kainate 1
Name:Glutamate receptor ionotropic, kainate 1
Type:Enzyme Catalytic Domain
Mol. Mass.:103984.96
Organism:Homo sapiens (Human)
Description:P39086
Residue:918
BDBM17657
NameBDBM17657
Synonyms:(2S)-2-aminopentanedioic acid D-Glutamate L-Glu L-Glutamic acid L-gluatmate
TypeAmino Acid
Emp. Form.C5H9NO4
Mol. Mass.147.1293
SMILESN[C@@H](CCC(O)=O)C(O)=O