Reaction Details
TargetGlutamate receptor ionotropic, kainate 2
LigandBDBM50089912
Substrate/Competitorn/a
Meas. Tech.ChEBML_71992
Ki 450±n/a nM
Citation Baker, SRBleakman, DEzquerra, JBallyk, BADeverill, MHo, KKamboj, RKCollado, IDomínguez, CEscribano, AMateo, AIPedregal, CRubio, A 4-Alkylidenyl glutamic acids, potent and selective GluR5 agonists. Bioorg Med Chem Lett10:1807-10 (2000) Glutamate receptor ionotropic, kainate 2
Name:Glutamate receptor ionotropic, kainate 2
Type:Enzyme Catalytic Domain
Mol. Mass.:102592.78
Organism:Homo sapiens (Human)
Description:Q13002
Residue:908
BDBM50089912
NameBDBM50089912
Synonyms:(2S)-2-amino-4-methylidenepentanedioic acid CHEMBL38499
TypeSmall organic molecule
Emp. Form.C6H9NO4
Mol. Mass.159.14
SMILESN[C@@H](CC(=C)C(O)=O)C(O)=O