Reaction Details
TargetGlutamate receptor ionotropic, kainate 3
LigandBDBM17657
Substrate/Competitorn/a
Meas. Tech.ChEBML_90598
Ki 789±n/a nM
Citation Baker, SRBleakman, DEzquerra, JBallyk, BADeverill, MHo, KKamboj, RKCollado, IDomínguez, CEscribano, AMateo, AIPedregal, CRubio, A 4-Alkylidenyl glutamic acids, potent and selective GluR5 agonists. Bioorg Med Chem Lett10:1807-10 (2000) Glutamate receptor ionotropic, kainate 3
Name:Glutamate receptor ionotropic, kainate 3
Type:Enzyme Catalytic Domain
Mol. Mass.:104046.44
Organism:Homo sapiens (Human)
Description:Glutamate-Kainate 7 0 HUMAN::Q13003
Residue:919
BDBM17657
NameBDBM17657
Synonyms:(2S)-2-aminopentanedioic acid D-Glutamate L-Glu L-Glutamic acid L-gluatmate
TypeAmino Acid
Emp. Form.C5H9NO4
Mol. Mass.147.1293
SMILESN[C@@H](CCC(O)=O)C(O)=O