Reaction Details
TargetReverse transcriptase/RNaseH
LigandBDBM1866
Substrate/Competitorn/a
Meas. Tech.ChEMBL_195054 (CHEMBL798358)
IC50 800±n/a nM
Citation Venkatachalam, TKSudbeck, EAMao, CUckun, FM Stereochemistry of halopyridyl and thiazolyl thiourea compounds is a major determinant of their potency as nonnucleoside inhibitors of HIV-1 reverse transcriptase. Bioorg Med Chem Lett10:2071-4 (2000) Reverse transcriptase/RNaseH
Name:Reverse transcriptase/RNaseH
Type:PROTEIN
Mol. Mass.:65229.15
Organism:Human immunodeficiency virus 1
Description:ChEMBL_1473730
Residue:566
BDBM1866
NameBDBM1866
Synonyms:3-(5-bromopyridin-2-yl)-1-[2-(pyridin-2-yl)ethyl]thiourea hydrochloride LY300046HCl PETT deriv. | Trovirdine
TypeSmall organic molecule
Emp. Form.C13H13BrN4S
Mol. Mass.337.238
SMILESBrc1ccc(NC(=S)NCCc2ccccn2)nc1