Reaction Details
TargetReverse transcriptase/RNaseH
LigandBDBM50091971
Substrate/Competitorn/a
Meas. Tech.ChEMBL_196044 (CHEMBL802221)
Ki>100000±n/a nM
Citation Venkatachalam, TKSudbeck, EAMao, CUckun, FM Stereochemistry of halopyridyl and thiazolyl thiourea compounds is a major determinant of their potency as nonnucleoside inhibitors of HIV-1 reverse transcriptase. Bioorg Med Chem Lett10:2071-4 (2000) Reverse transcriptase/RNaseH
Name:Reverse transcriptase/RNaseH
Type:PROTEIN
Mol. Mass.:65229.15
Organism:Human immunodeficiency virus 1
Description:ChEMBL_1473730
Residue:566
BDBM50091971
NameBDBM50091971
Synonyms:1-((R)-1-Cyclohexyl-ethyl)-3-pyridin-2-yl-thiourea HI-543
TypeSmall organic molecule
Emp. Form.C14H21N3S
Mol. Mass.263.402
SMILESC[C@@H](NC(=S)Nc1ccccn1)C1CCCCC1