Reaction Details
TargetReverse transcriptase/RNaseH
LigandBDBM50091969
Substrate/Competitorn/a
Meas. Tech.ChEMBL_195054 (CHEMBL798358)
IC50 1600±n/a nM
Citation Venkatachalam, TKSudbeck, EAMao, CUckun, FM Stereochemistry of halopyridyl and thiazolyl thiourea compounds is a major determinant of their potency as nonnucleoside inhibitors of HIV-1 reverse transcriptase. Bioorg Med Chem Lett10:2071-4 (2000) Reverse transcriptase/RNaseH
Name:Reverse transcriptase/RNaseH
Type:PROTEIN
Mol. Mass.:65229.15
Organism:Human immunodeficiency virus 1
Description:ChEMBL_1473730
Residue:566
BDBM50091969
NameBDBM50091969
Synonyms:1-(5-Bromo-pyridin-2-yl)-3-((R)-1-phenyl-ethyl)-thiourea HI-511
TypeSmall organic molecule
Emp. Form.C14H14BrN3S
Mol. Mass.336.25
SMILESC[C@@H](NC(=S)Nc1ccc(Br)cn1)c1ccccc1