Reaction Details
TargetProtein kinase C epsilon type
LigandBDBM50057511
Substrate/Competitorn/a
Meas. Tech.ChEMBL_161113 (CHEMBL772745)
Ki 7.7±n/a nM
Citation Nakagawa, YIrie, KOhigashi, HHayashi, HWender, PA Synthesis and PKC isozyme surrogate binding of indothiolactam-V, a new thioamide analogue of tumor promoting indolactam-V. Bioorg Med Chem Lett10:2087-90 (2000) Protein kinase C epsilon type
Name:Protein kinase C epsilon type
Type:Enzyme
Mol. Mass.:83680.45
Organism:Homo sapiens (Human)
Description:The recombinant human PKC enzymes were produced using a baculovirus expression system in SF9 cells
Residue:737
BDBM50057511
NameBDBM50057511
Synonyms:(+/-)-indolactum-V 13-Hydroxymethyl-10-isopropyl-9-methyl-3,9,12-triaza-tricyclo[6.6.1.0*4,15*]pentadeca-1,4,6,8(15)-tetraen-11-one (10S,13S)-13-Hydroxymethyl-10-isopropyl-9-methyl-3,9,12-triaza-tricyclo[6.6.1.0*4,15*]pentadeca-1,4(15),5,7-tetraen-11-one (2S,5S)-5-(hydroxymethyl)-2-isopropyl-1-methyl-1,2,5,6-tetrahydro-4H-[1,4]diazonino[7,6,5-cd]indol-3(8H)-one 13-Hydroxymethyl-10-isopropyl-9-methyl-3,9,12-triaza-tricyclo[6.6.1.0*4,15*]pentadeca-1,4(15),5,7-tetraen-11-one CHEMBL27266 indolactam-V
TypeSmall organic molecule
Emp. Form.C17H23N3O2
Mol. Mass.301.3834
SMILESCC(C)[C@@H]1N(C)c2cccc3[nH]cc(C[C@@H](CO)NC1=O)c23