Reaction Details
TargetIntegrin alpha-V/beta-3
LigandBDBM50085018
Substrate/Competitorn/a
Meas. Tech.ChEMBL_217642 (CHEMBL818514)
IC50 40±n/a nM
Citation Peyman, AWehner, VKnolle, JStilz, HUBreipohl, GScheunemann, KHCarniato, DRuxer, JMGourvest, JFGadek, TRBodary, S RGD mimetics containing a central hydantoin scaffold: alpkha(v)beta3 vs alpha(IIb)beta3 selectivity requirements. Bioorg Med Chem Lett10:179-82 (2000) Integrin alpha-V/beta-3
Name:Integrin alpha-V/beta-3
Type:Enzyme
Mol. Mass.:n/a
Description:n/a
Components:This complex has 2 components.
Component 1
Name:Integrin alpha-V
Synonyms:ITAV_HUMAN Integrin alpha-V/alpha-5 VNRA Vitronectin receptor | Vitronectin receptor subunit alpha
Type:PROTEIN
Mol. Mass.:116024.92
Organism:Homo sapiens (Human)
Description:ChEMBL_582336
Residue:1048
Component 2
Name:Integrin beta-3
Synonyms:CD_antigen=CD61 GPIIIa ITGB3 Platelet membrane glycoprotein IIIa
Type:Protein
Mol. Mass.:87038.91
Organism:Homo sapiens (Human)
Description:P05106
Residue:788
BDBM50085018
NameBDBM50085018
Synonyms:3-(2-{(S)-4-[3-(1H-Benzoimidazol-2-ylamino)-propyl]-2,5-dioxo-imidazolidin-1-yl}-acetylamino)-2-benzyloxycarbonylamino-propionic acid anion
TypeSmall organic molecule
Emp. Form.C26H28N7O7
Mol. Mass.550.5438
SMILESOc1c(CCCNc2nc3ccccc3[nH]2)[nH]c(=O)n1CC(=O)NCC(NC(=O)OCc1ccccc1)C([O-])=O