Reaction Details
TargetDelta-type opioid receptor
LigandBDBM50085029
Substrate/Competitorn/a
Meas. Tech.ChEBML_147147
Ki 470±n/a nM
Citation Wentland, MPXu, GCioffi, CLYe, YDuan, WCohen, DJColasurdo, AMBidlack, JM 8-Aminocyclazocine analogues: synthesis and structure-activity relationships. Bioorg Med Chem Lett10:183-7 (2000) Delta-type opioid receptor
Name:Delta-type opioid receptor
Type:G Protein-Coupled Receptor (GPCR)
Mol. Mass.:40382.98
Organism:Homo sapiens (Human)
Description:Competition binding assays were carried out using membrane preparations from transfected HN9.10 cells that constitutively expressed the delta opioid receptor.
Residue:372
BDBM50085029
NameBDBM50085029
Synonyms:((6S,11R)-3-Cyclopropylmethyl-6,11-dimethyl-1,2,3,4,5,6-hexahydro-2,6-methano-benzo[d]azocin-8-yl)-methyl-amine (3-Cyclopropylmethyl-6,11-dimethyl-1,2,3,4,5,6-hexahydro-2,6-methano-benzo[d]azocin-8-yl)-methyl-amine.2HCl.C2H6O.H2O | CHEMBL291751
TypeSmall organic molecule
Emp. Form.C19H28N2
Mol. Mass.284.439
SMILESCNc1ccc2CC3[C@H](C)[C@](C)(CCN3CC3CC3)c2c1