Reaction Details
TargetMu-type opioid receptor
LigandBDBM50369586
Substrate/Competitorn/a
Meas. Tech.ChEMBL_145278 (CHEMBL751214)
Ki 1.10±n/a nM
Citation Wentland, MPXu, GCioffi, CLYe, YDuan, WCohen, DJColasurdo, AMBidlack, JM 8-Aminocyclazocine analogues: synthesis and structure-activity relationships. Bioorg Med Chem Lett10:183-7 (2000) Mu-type opioid receptor
Name:Mu-type opioid receptor
Type:Enzyme Catalytic Domain
Mol. Mass.:11165.58
Organism:GUINEA PIG
Description:P97266
Residue:98
BDBM50369586
NameBDBM50369586
Synonyms:CHEMBL326516
TypeSmall organic molecule
Emp. Form.C24H30N2
Mol. Mass.346.5084
SMILESC[C@H]1[C@H]2Cc3ccc(Nc4ccccc4)cc3[C@@]1(C)CCN2CC1CC1