Reaction Details
TargetReverse transcriptase/RNaseH
LigandBDBM50085036
Substrate/Competitorn/a
Meas. Tech.ChEBML_195837
IC50 24667±n/a nM
Citation Corbett, JWGearhart, LAKo, SSRodgers, JDCordova, BCKlabe, RMErickson-Viitanen, SK Novel 2,2-dioxide-4,4-disubstituted-1,3-H-2,1,3-benzothiadiazines as non-nucleoside reverse transcriptase inhibitors. Bioorg Med Chem Lett10:193-5 (2000) Reverse transcriptase/RNaseH
Name:Reverse transcriptase/RNaseH
Type:PROTEIN
Mol. Mass.:65229.15
Organism:Human immunodeficiency virus 1
Description:ChEMBL_1473730
Residue:566
BDBM50085036
NameBDBM50085036
Synonyms:4-Cyclopropylethynyl-5,6-difluoro-4-trifluoromethyl-3,4-dihydro-1H-benzo[1,2,6]thiadiazine 2,2-dioxide | CHEMBL299935
TypeSmall organic molecule
Emp. Form.C13H9F5N2O2S
Mol. Mass.352.28
SMILESFc1ccc2NS(=O)(=O)NC(C#CC3CC3)(c2c1F)C(F)(F)F