Reaction Details
TargetReverse transcriptase/RNaseH
LigandBDBM50085037
Substrate/Competitorn/a
Meas. Tech.ChEBML_195837
IC50 35870±n/a nM
Citation Corbett, JWGearhart, LAKo, SSRodgers, JDCordova, BCKlabe, RMErickson-Viitanen, SK Novel 2,2-dioxide-4,4-disubstituted-1,3-H-2,1,3-benzothiadiazines as non-nucleoside reverse transcriptase inhibitors. Bioorg Med Chem Lett10:193-5 (2000) Reverse transcriptase/RNaseH
Name:Reverse transcriptase/RNaseH
Type:PROTEIN
Mol. Mass.:65229.15
Organism:Human immunodeficiency virus 1
Description:ChEMBL_1473730
Residue:566
BDBM50085037
NameBDBM50085037
Synonyms:6-Chloro-4-cyclopropyl-4-cyclopropylethynyl-3,4-dihydro-1H-benzo[1,2,6]thiadiazine 2,2-dioxide | CHEMBL58552
TypeSmall organic molecule
Emp. Form.C15H15ClN2O2S
Mol. Mass.322.81
SMILESClc1ccc2NS(=O)(=O)NC(C#CC3CC3)(C3CC3)c2c1