Reaction Details
TargetDelta-type opioid receptor
LigandBDBM82551
Substrate/Competitorn/a
Meas. Tech.ChEMBL_145495 (CHEMBL752137)
Ki 5.7±n/a nM
Citation Jales, ARHusbands, SMLewis, JW Selective kappa-opioid antagonists related to naltrindole. Effect of side-chain spacer in the 5'-amidinoalkyl series. Bioorg Med Chem Lett10:2259-61 (2001) Delta-type opioid receptor
Name:Delta-type opioid receptor
Type:G Protein-Coupled Receptor (GPCR)
Mol. Mass.:40382.98
Organism:Homo sapiens (Human)
Description:Competition binding assays were carried out using membrane preparations from transfected HN9.10 cells that constitutively expressed the delta opioid receptor.
Residue:372
BDBM82551
NameBDBM82551
Synonyms:C18130 NOR-BNI (HCI)2 | NORBNI
TypeSmall organic molecule
Emp. Form.C40H43N3O6
Mol. Mass.661.7859
SMILESOc1ccc2C[C@H]3N(CC4CC4)CC[C@@]45[C@@H](Oc1c24)c1[nH]c2[C@@H]4Oc6c7c(C[C@H]8N(CC9CC9)CC[C@@]47[C@@]8(O)Cc2c1C[C@@]35O)ccc6O