Reaction Details
TargetKappa-type opioid receptor
LigandBDBM50092998
Substrate/Competitorn/a
Meas. Tech.ChEBML_146655
Ki 0.061000±n/a nM
Citation Jales, ARHusbands, SMLewis, JW Selective kappa-opioid antagonists related to naltrindole. Effect of side-chain spacer in the 5'-amidinoalkyl series. Bioorg Med Chem Lett10:2259-61 (2001) Kappa-type opioid receptor
Name:Kappa-type opioid receptor
Type:G Protein-Coupled Receptor (GPCR)
Mol. Mass.:42744.99
Organism:Cavia porcellus (domestic guinea pig)
Description:P41144
Residue:380
BDBM50092998
NameBDBM50092998
Synonyms:CHEMBL72786 | Derivative of Natrindole
TypeSmall organic molecule
Emp. Form.C32H38N4O3
Mol. Mass.526.6691
SMILESCCCCC(=N)NCc1ccc2[nH]c3C4Oc5c6c(CC7N(CC8CC8)CCC46[C@@]7(O)Cc3c2c1)ccc5O