Reaction Details
TargetDelta-type opioid receptor
LigandBDBM50092999
Substrate/Competitorn/a
Meas. Tech.ChEMBL_145495 (CHEMBL752137)
Ki 28±n/a nM
Citation Jales, ARHusbands, SMLewis, JW Selective kappa-opioid antagonists related to naltrindole. Effect of side-chain spacer in the 5'-amidinoalkyl series. Bioorg Med Chem Lett10:2259-61 (2001) Delta-type opioid receptor
Name:Delta-type opioid receptor
Type:G Protein-Coupled Receptor (GPCR)
Mol. Mass.:40382.98
Organism:Homo sapiens (Human)
Description:Competition binding assays were carried out using membrane preparations from transfected HN9.10 cells that constitutively expressed the delta opioid receptor.
Residue:372
BDBM50092999
NameBDBM50092999
Synonyms:5'-(2-aminoethyl)Natrindole | CHEMBL72885
TypeSmall organic molecule
Emp. Form.C28H31N3O3
Mol. Mass.457.564
SMILESNCCc1ccc2[nH]c3C4Oc5c6c(CC7N(CC8CC8)CCC46[C@@]7(O)Cc3c2c1)ccc5O