Reaction Details
TargetKappa-type opioid receptor
LigandBDBM50092999
Substrate/Competitorn/a
Meas. Tech.ChEMBL_145262 (CHEMBL751200)
Ki 0.120000±n/a nM
Citation Jales, ARHusbands, SMLewis, JW Selective kappa-opioid antagonists related to naltrindole. Effect of side-chain spacer in the 5'-amidinoalkyl series. Bioorg Med Chem Lett10:2259-61 (2001) Kappa-type opioid receptor
Name:Kappa-type opioid receptor
Type:G Protein-Coupled Receptor (GPCR)
Mol. Mass.:42648.76
Organism:Homo sapiens (Human)
Description:P41145
Residue:380
BDBM50092999
NameBDBM50092999
Synonyms:5'-(2-aminoethyl)Natrindole | CHEMBL72885
TypeSmall organic molecule
Emp. Form.C28H31N3O3
Mol. Mass.457.564
SMILESNCCc1ccc2[nH]c3C4Oc5c6c(CC7N(CC8CC8)CCC46[C@@]7(O)Cc3c2c1)ccc5O