Reaction Details
TargetTransporter
LigandBDBM50046732
Substrate/Competitorn/a
Meas. Tech.ChEMBL_143122 (CHEMBL748004)
Ki 3.1±n/a nM
Citation Blough, BEHolmquist, CRAbraham, PKuhar, MJCarroll, FI 3alpha-(4-Substituted phenyl)nortropane-2beta-carboxylic acid methyl esters show selective binding at the norepinephrine transporter. Bioorg Med Chem Lett10:2445-7 (2001) Transporter
Name:Transporter
Type:PROTEIN
Mol. Mass.:66787.87
Organism:Rattus norvegicus
Description:ChEMBL_1463061
Residue:597
BDBM50046732
NameBDBM50046732
Synonyms:(R)-3-(4-Chloro-phenyl)-8-aza-bicyclo[3.2.1]octane-2-carboxylic acid methyl ester 3-(4-Fluoro-phenyl)-8-methyl-8-aza-bicyclo[3.2.1]octane-2-carboxylic acid methyl ester | CHEMBL81525
TypeSmall organic molecule
Emp. Form.C15H18ClNO2
Mol. Mass.279.762
SMILESCOC(=O)C1C2CCC(CC1c1ccc(Cl)cc1)N2