Reaction Details
TargetMu-type opioid receptor
LigandBDBM21864
Substrate/Competitorn/a
Meas. Tech.ChEBML_149003
Ki 3.7±n/a nM
Citation Coop, AJacobson, AEAceto, MDHarris, LSTraynor, JRWoods, JHRice, KC N-Cyclohexylethyl-N-noroxymorphindole: a mu-opioid preferring analogue of naltrindole. Bioorg Med Chem Lett10:2449-51 (2001) Mu-type opioid receptor
Name:Mu-type opioid receptor
Type:G Protein-Coupled Receptor (GPCR)
Mol. Mass.:44503.11
Organism:Rattus norvegicus (rat)
Description:Competition binding assays were carried out using membrane preparations from transfected HN9.10 cells that constitutively expressed the mu opioid receptor.
Residue:398
BDBM21864
NameBDBM21864
Synonyms:(21R)-22-(cyclopropylmethyl)-14-oxa-11,22-diazaheptacyclo[13.9.1.0^{1,13}.0^{2,21}.0^{4,12}.0^{5,10}.0^{19,25}]pentacosa-4(12),5,7,9,15,17,19(25)-heptaene-2,16-diol NALTRINDOLE | [3H]-naltrindole
Typeradiolabeled ligand
Emp. Form.C26H26N2O3
Mol. Mass.414.4962
SMILES[H][C@@]12Cc3ccc(O)c4OC5c6[nH]c7ccccc7c6CC1(O)C5(CCN2CC1CC1)c34