Reaction Details
TargetDelta-type opioid receptor
LigandBDBM50093783
Substrate/Competitorn/a
Meas. Tech.ChEBML_147047
Ki 115±n/a nM
Citation Coop, AJacobson, AEAceto, MDHarris, LSTraynor, JRWoods, JHRice, KC N-Cyclohexylethyl-N-noroxymorphindole: a mu-opioid preferring analogue of naltrindole. Bioorg Med Chem Lett10:2449-51 (2001) Delta-type opioid receptor
Name:Delta-type opioid receptor
Type:G Protein-Coupled Receptor (GPCR)
Mol. Mass.:40465.04
Organism:Rattus norvegicus (rat)
Description:Competition binding assays were using CHO-K1 cell membranes expressing the opioid receptor.
Residue:372
BDBM50093783
NameBDBM50093783
Synonyms:CHEMBL81355 | [1,5-3H]-17-Benzyl-6,7-dehydro-4,5a -epoxy-3,14-dihydroxy-6,7-2,3-indolo-morphinan
TypeSmall organic molecule
Emp. Form.C29H26N2O3
Mol. Mass.450.5283
SMILESOc1ccc2C[C@H]3N(Cc4ccccc4)CCC45C(Oc1c24)c1[nH]c2ccccc2c1C[C@@]35O