Reaction Details
TargetMu-type opioid receptor
LigandBDBM50093785
Substrate/Competitorn/a
Meas. Tech.ChEBML_149003
Ki 7.3±n/a nM
Citation Coop, AJacobson, AEAceto, MDHarris, LSTraynor, JRWoods, JHRice, KC N-Cyclohexylethyl-N-noroxymorphindole: a mu-opioid preferring analogue of naltrindole. Bioorg Med Chem Lett10:2449-51 (2001) Mu-type opioid receptor
Name:Mu-type opioid receptor
Type:G Protein-Coupled Receptor (GPCR)
Mol. Mass.:44503.11
Organism:Rattus norvegicus (rat)
Description:Competition binding assays were carried out using membrane preparations from transfected HN9.10 cells that constitutively expressed the mu opioid receptor.
Residue:398
BDBM50093785
NameBDBM50093785
Synonyms:CHEMBL80116 | [1,5-3H]-17-Cyclohexylethyl-6,7-dehydro-4,5a -epoxy-3,14-dihydroxy-6,7-2,3-indolo-morphinan
TypeSmall organic molecule
Emp. Form.C30H34N2O3
Mol. Mass.470.6026
SMILESOc1ccc2C[C@H]3N(CCC4CCCCC4)CCC45C(Oc1c24)c1[nH]c2ccccc2c1C[C@@]35O