Reaction Details
TargetMu-type opioid receptor
LigandBDBM50095150
Substrate/Competitorn/a
Meas. Tech.ChEMBL_148863 (CHEMBL756659)
Ki 54±n/a nM
Citation Cardillo, GGentilucci, LMelchiorre, PSpampinato, S Synthesis and binding activity of endomorphin-1 analogues containing beta-amino acids. Bioorg Med Chem Lett10:2755-8 (2000) Mu-type opioid receptor
Name:Mu-type opioid receptor
Type:G Protein-Coupled Receptor (GPCR)
Mol. Mass.:44503.11
Organism:Rattus norvegicus (rat)
Description:Competition binding assays were carried out using membrane preparations from transfected HN9.10 cells that constitutively expressed the mu opioid receptor.
Residue:398
BDBM50095150
NameBDBM50095150
Synonyms:(R)-1-[(S)-2-Amino-3-(4-hydroxy-phenyl)-propionyl]-pyrrolidine-2-carboxylic acid [(S)-1-((S)-1-carbamoyl-2-phenyl-ethylcarbamoyl)-2-(1H-indol-3-yl)-ethyl]-amide Endomorphin 1
TypeSmall organic molecule
Emp. Form.C34H38N6O5
Mol. Mass.610.7027
SMILESN[C@@H](Cc1ccc(O)cc1)C(=O)N1CCC[C@@H]1C(=O)N[C@@H](Cc1c[nH]c2ccccc12)C(=O)N[C@@H](Cc1ccccc1)C(N)=O