Reaction Details
TargetMu-type opioid receptor
LigandBDBM50086682
Substrate/Competitorn/a
Meas. Tech.ChEBML_146695
Ki 1100±n/a nM
Citation King, CHMeckler, HHerr, RJTrova, MPGlick, SDMaisonneuve, IM Synthesis of enantiomerically pure (+)- and (-)-18-methoxycoronaridine hydrochloride and their preliminary assessment as anti-addictive agents. Bioorg Med Chem Lett10:473-6 (2000) Mu-type opioid receptor
Name:Mu-type opioid receptor
Type:Enzyme Catalytic Domain
Mol. Mass.:45038.37
Organism:CALF
Description:OPIATE Mu 2 0 CALF::P79350
Residue:401
BDBM50086682
NameBDBM50086682
Synonyms:(+)-18-Methoxycoronaridine hydrochloride (-)-18-Methoxycoronaridine hydrochloride | CHEMBL554230
TypeSmall organic molecule
Emp. Form.C22H28N2O3
Mol. Mass.368.4693
SMILESCOCCC1CC2CN3CCc4c([nH]c5ccccc45)C(C2)(C13)C(=O)OC