Reaction Details
Target4-galactosyl-N-acetylglucosaminide 3-alpha-L-fucosyltransferase FUT5
LigandBDBM92459
Substrate/Competitorn/a
Meas. Tech.ChEBML_69264
IC50 67000±n/a nM
Citation Schuster, MBlechert, S Inhibition of fucosyltransferase V by a GDP-Azasugar. Bioorg Med Chem Lett11:1809-11 (2001) 4-galactosyl-N-acetylglucosaminide 3-alpha-L-fucosyltransferase FUT5
Name:4-galactosyl-N-acetylglucosaminide 3-alpha-L-fucosyltransferase FUT5
Type:PROTEIN
Mol. Mass.:43016.71
Organism:Homo sapiens (Human)
Description:ChEMBL_69264
Residue:374
BDBM92459
NameBDBM92459
Synonyms:CHEMBL384759 Guanosine Diphosphate
TypeSmall molecule
Emp. Form.C10H15N5O11P2
Mol. Mass.443.2005
SMILESNc1nc2n(cnc2c(=O)[nH]1)[C@@H]1O[C@H](COP(O)(=O)OP(O)(O)=O)[C@@H](O)[C@H]1O