Reaction Details
TargetGrowth hormone secretagogue receptor type 1
LigandBDBM50049478
Substrate/Competitorn/a
Meas. Tech.ChEBML_84953
IC50 0.630000±n/a nM
Citation Palucki, BLFeighner, SDPong, SMcKee, KKHreniuk, DLTan, CHoward, ADVan der Ploeg, LHPatchett, AANargund, RP Spiro(indoline-3,4'-piperidine) growth hormone secretagogues as ghrelin mimetics. Bioorg Med Chem Lett11:1955-7 (2001) Growth hormone secretagogue receptor type 1
Name:Growth hormone secretagogue receptor type 1
Type:Receptor
Mol. Mass.:41334.57
Organism:Homo sapiens (Human)
Description:Receptor binding studies use plasma membranes from LLC PK-1 cells transiently transfected with hGHSR1a.
Residue:366
BDBM50049478
NameBDBM50049478
Synonyms:1-{[(2R)-3-(benzyloxy)-1-{1-methanesulfonyl-1,2-dihydrospiro[indole-3,4'-piperidine]-1'-yl}-1-oxopropan-2-yl]carbamoyl}-1-methylethan-1-aminium 1N-[1-benzyloxymethyl-2-[1-methylsulfonylspiro[2,3-dihydro-1H-indole-3,4'-(hexahydropyridine)]-1-yl]-2-oxo-(1R)-ethyl]-2-amino-2-methylpropanamide [3a(MK-0677)] CHEMBL13817 MK-0677 | MK-677
TypeSmall organic molecule
Emp. Form.C27H36N4O5S
Mol. Mass.528.664
SMILESCC(C)(N)C(=O)N[C@H](COCc1ccccc1)C(=O)N1CCC2(CN(c3ccccc23)S(C)(=O)=O)CC1