Reaction Details
TargetGrowth hormone secretagogue receptor type 1
LigandBDBM50102231
Substrate/Competitorn/a
Meas. Tech.ChEMBL_72513 (CHEMBL685178)
IC50 8.1±n/a nM
Citation Palucki, BLFeighner, SDPong, SMcKee, KKHreniuk, DLTan, CHoward, ADVan der Ploeg, LHPatchett, AANargund, RP Spiro(indoline-3,4'-piperidine) growth hormone secretagogues as ghrelin mimetics. Bioorg Med Chem Lett11:1955-7 (2001) Growth hormone secretagogue receptor type 1
Name:Growth hormone secretagogue receptor type 1
Type:Receptor
Mol. Mass.:41334.57
Organism:Homo sapiens (Human)
Description:Receptor binding studies use plasma membranes from LLC PK-1 cells transiently transfected with hGHSR1a.
Residue:366
BDBM50102231
NameBDBM50102231
Synonyms:2-(1-amino-1-methylethylcarboxamido)-3-[1-methylsulfonylspiro[2,3-dihydro-1H-indole-3,4'-(hexahydropyridine)]-1-yl]-3-oxo-(2R)-propyl octanoate; Trifluoroacetate | CHEMBL294324
TypeSmall organic molecule
Emp. Form.C28H44N4O6S
Mol. Mass.564.737
SMILESCCCCCCCC(=O)OC[C@@H](NC(=O)C(C)(C)N)C(=O)N1CCC2(CN(c3ccccc23)S(C)(=O)=O)CC1