Reaction Details
TargetBeta-glucosidase A
LigandBDBM50104303
Substrate/Competitorn/a
Meas. Tech.ChEMBL_37437 (CHEMBL650052)
IC50 250000±n/a nM
Citation Popowycz, FGerber-Lemaire, SDemange, RRodriguez-García, EAsenjo, ATRobina, IVogel, P Derivatives of (2R,3R,4S)-2-aminomethylpyrrolidine-3,4-diol are selective alpha-mannosidase inhibitors. Bioorg Med Chem Lett11:2489-93 (2001) Beta-glucosidase A
Name:Beta-glucosidase A
Type:PROTEIN
Mol. Mass.:53484.21
Organism:Caldocellum saccharolyticum
Description:ChEMBL_37437
Residue:455
BDBM50104303
NameBDBM50104303
Synonyms:2-{[(Furan-2-ylmethyl)-amino]-methyl}-pyrrolidine-3,4-diol | CHEMBL313295
TypeSmall organic molecule
Emp. Form.C10H16N2O3
Mol. Mass.212.2456
SMILESOC1CNC(CNCc2ccco2)C1O