Reaction Details
TargetBeta-glucosidase
LigandBDBM50104303
Substrate/Competitorn/a
Meas. Tech.ChEBML_37428
IC50 140000±n/a nM
Citation Popowycz, FGerber-Lemaire, SDemange, RRodriguez-García, EAsenjo, ATRobina, IVogel, P Derivatives of (2R,3R,4S)-2-aminomethylpyrrolidine-3,4-diol are selective alpha-mannosidase inhibitors. Bioorg Med Chem Lett11:2489-93 (2001) Beta-glucosidase
Name:Beta-glucosidase
Synonyms:n/a
Type:PROTEIN
Mol. Mass.:60428.49
Organism:Prunus avium
Description:ChEMBL_37428
Residue:531
BDBM50104303
NameBDBM50104303
TypeSmall organic molecule
Emp. Form.C10H16N2O3
Mol. Mass.212.2456
SMILESOC1CNC(CNCc2ccco2)C1O